{"text_format":"1","workbook":"xlsx","n_sheets":14,"sheets":["PLANILHA_SINTÉTICA","Cotações","Composições","RESUMO","FOLHA FECHAMENTO","BDI","QUANTITATIVO","CURVA ABC","DECLARAÇÃO","PLANILHA REFERENCIA DETRAN PR","POR LOTE","der","dnit","scorj"],"not_rendered":{"charts":0,"images":7,"macros":1,"external_links":4,"defined_names":15,"comments":0,"pivot_tables":0},"unopened":[],"bounds":{"document_bytes":16777216,"sheet_cells":100000,"rows_first":2000,"rows_last":500,"rows_between":2000,"halvings":0,"cell_chars":16384,"cell_head_chars":4096},"cells_cut":0,"cells_raw":0,"read":"whole","date_system":"1900"}

{"sheet":"PLANILHA_SINTÉTICA","index":0,"n_rows":57,"n_cols":18,"rows_kept":57,"cut":false,"hidden":false,"merged":[[2,4,2,6],[4,2,4,12],[52,7,52,10],[51,7,51,10],[51,11,51,12],[52,11,52,12],[53,11,53,12],[53,7,53,10],[7,17,11,22],[6,2,6,12],[7,2,7,12]]}
[]
[]
[null,null,null," ","ANEXO X - LOTE 2",null,null," "]
[]
[null,null,"PLANILHA DE SERVIÇOS SINTÉTICA NÃO DESONERADA"]
[]
[null,null,"DEPARTAMENTO ESTADUAL DE TRÂNSITO - DETRAN PR"]
[null,null,"COORDENADORIA DE ENGENHARIA E ARQUITETURA - DIVISÃO DE SINALIZAÇÃO",null,null,null,null,null,null,null,null,null,null,null,null,null,null,"EDITAR OS ITENS EM VERMELHO E APAGAR OS ITENS COM QUANTITATIVO ZERADO"]
[null,null,"PROJETO DE SINALIZAÇÃO VIÁRIA URBANA",null,{"$f":"'FOLHA FECHAMENTO'!D12","v":"lote 02"},null,null,null,null,null,"ART/RRT Nº:",{"$f":"'FOLHA FECHAMENTO'!M18","v":"16594464"}]
[null,"ref.",{"$f":"'FOLHA FECHAMENTO'!F41","v":"SICRO (OUT/2025), DER (AGO/2025) e SCO-RIO (DEZ/2025), SIURB (OUT/2025) S. DESONERAÇÃO"},null,"RESPONSÁVEL TÉCNICO: ",null,{"$f":"'FOLHA FECHAMENTO'!H17","v":"Amanda Patricia de Oliveira Henning"},null,null,null,"REG. CREA/CAU: ",{"$f":"'FOLHA FECHAMENTO'!M17","v":"A284127-4"}]
{"$rows_left_out":48}
{"sheet":"Cotações","index":1,"n_rows":36,"n_cols":10,"rows_kept":36,"cut":false,"hidden":true,"merged":[[35,2,35,4],[5,9,9,9],[10,2,10,4],[11,2,11,4],[13,9,17,9],[18,2,18,4],[19,2,19,4],[21,9,25,9],[26,2,26,4],[27,2,27,4],[29,9,33,9],[34,2,34,4]]}
[]
[]
[]
[]
[]
[null,null,null,null,null,null,"FORNECEDOR 1","FORNECEDOR 2","FORNECEDOR 3","MÉDIA PREÇO R$"]
[null,null,null,null,"DATA DA COTAÇÃO",null,"2025-11-10","2025-11-07","2025-11-11"]
[null,null,null,null,"EMPRESA",null,"EBITECH 3","IESSA TECNOLOGIA","WH SUL"]
[null,null,null,null,"CONTATO",null,"contato@ebitech3.com.br","comercial@iessa.com.br","comercial@whsul.com.br"]
[null,null,null,null,"TELEFONE / E-MAIL / SITE",null,"email","email","email"]
{"$rows_left_out":27}
{"sheet":"Composições","index":2,"n_rows":262,"n_cols":12,"rows_kept":262,"cut":false,"hidden":true,"merged":[[212,2,212,7],[232,2,232,7]]}
[]
[null,"PLANILHA","CÓDIGO","NOME","DESCRIÇÃO","UNID.","COEF.","R$/UNIT.","TOTAL","Material","Mão de obra","Código e Referência da Composição de Custos"]
[null,"DETRAN",null,"COMP.01","Suporte metálico galv. fogo d=2,5\" c/tampa e aletas anti-giro, h=2,00m","unid",null,null,{"$f":"SUM(I4:I17)","v":299.64999999999998},{"$f":"SUM(I4:I7)+SUM(I12:I17)","v":261.14},{"$f":"I8+I9+I10+I11","v":38.51},"DER/821300 - AGOSTO 2025\nADAPTADO"]
[null,"der-pr",373200,"MAT","Betoneira 600 l gasolina","hr ",1,0.59,{"$f":"ROUND(H4*G4,2)","v":0.59}]
[null,"der-pr",346080,"MAT","Caminhão carroceria 815/37 6 t","hr ",1,25.57,{"$f":"ROUND(H5*G5,2)","v":25.57}]
[null,"der-pr",301800,"MAT","Carrinho de concretagem 80 l","hr ",1,0.02,0.02]
[null,"der-pr",370450,"MAT","Vibrador imersão gasolina 45mm","hr ",1,0.28999999999999998,0.28999999999999998]
[null,"der-pr",210060,"SER.AUX","Encarregado de Serviço","hr ",0.1,50.16,{"$f":"ROUND(H8*G8,2)","v":5.0199999999999996}]
[null,"der-pr",200260,"SER.AUX","Pedreiro","hr ",0.25,38.67,{"$f":"TRUNC(H9*G9,2)","v":9.66}]
[null,"der-pr",210090,"SER.AUX","Serralheiro","hr ",0.25,38.67,{"$f":"TRUNC(H10*G10,2)","v":9.66}]
{"$rows_left_out":253}
{"sheet":"RESUMO","index":3,"n_rows":22,"n_cols":13,"rows_kept":22,"cut":false,"hidden":false,"merged":[[3,12,6,17],[5,1,5,9],[21,1,21,3],[20,1,20,9],[11,1,11,9],[13,5,13,7],[15,2,15,4],[16,2,16,4],[13,9,14,9],[10,8,10,9],[13,1,14,1],[13,2,14,4],[13,8,14,8],[6,2,6,9],[7,2,7,9]]}
[]
[]
[]
[null,null,null,null,null,null,null,null,null,null,null,null,"EDITAR APENAS OS ITENS EM VERMELHO"]
[]
[null,"PLANILHA RESUMO DE SERVIÇOS "]
[null,null,"DEPARTAMENTO ESTADUAL DE TRÂNSITO - DETRAN PR"]
[null,null,"COORDENADORIA DE ENGENHARIA E ARQUITETURA - DIVISÃO DE SINALIZAÇÃO"]
[null,null,"PROJETO DE SINALIZAÇÃO VIÁRIA URBANA",null,null,{"$f":"'FOLHA FECHAMENTO'!D12","v":"lote 02"},null,null,"ART/RRT Nº:",{"$f":"'FOLHA FECHAMENTO'!M18","v":"16594464"}]
[null,null,"RESPONSÁVEL TÉCNICO: ",null,{"$f":"'FOLHA FECHAMENTO'!H17","v":"Amanda Patricia de Oliveira Henning"},null,null,"REG. CREA/CAU: ",{"$f":"'FOLHA FECHAMENTO'!M17","v":"A284127-4"}]
{"$rows_left_out":13}
{"sheet":"FOLHA FECHAMENTO","index":4,"n_rows":58,"n_cols":16,"rows_kept":58,"cut":false,"hidden":false,"merged":[[56,2,56,5],[56,7,56,8],[56,9,56,13],[57,2,57,5],[57,7,57,8],[57,9,57,13],[44,7,44,13],[54,2,54,5],[54,7,54,8],[54,9,54,13],[55,7,55,8],[55,9,55,13],[36,6,36,7],[36,8,36,9],[40,1,40,4],[42,1,42,4],[42,7,42,13],[11,11,11,13],[34,6,34,7],[34,8,34,9],[12,3,12,8],[13,3,13,8],[13,11,13,13],[15,7,15,9],[15,12,15,13],[17,7,17,9],[25,4,25,5],[31,7,31,9],[3,15,6,20],[9,1,9,10],[9,12,9,13],[10,3,10,7],[10,11,10,13]]}
[]
[]
[]
[null,null,null,null,null,null,null,null,null,null,null,null,null,null,null,"EDITAR APENAS OS ITENS EM AMARELO"]
[null,null," "]
[]
[]
[]
[]
[null,"FOLHA RESUMO  PARA FECHAMENTO DE ORÇAMENTO",null,null,null,null,null,null,null,null,null,"DATA:",{"$f":"TODAY()","v":"2026-08-05"}]
{"$rows_left_out":49}
{"sheet":"BDI","index":5,"n_rows":41,"n_cols":9,"rows_kept":41,"cut":false,"hidden":false,"merged":[[13,2,14,7],[37,5,37,7],[38,5,38,7],[39,5,39,7],[40,5,40,7],[2,16,5,21],[2,1,2,8],[3,1,3,8],[4,1,4,8],[11,1,11,7]]}
[]
[]
[null,"DEPARTAMENTO ESTADUAL DE TRÂNSITO\nCOORDENADORIA DE ENGENHARIA E ARQUITETURA\nDIVISÃO DE SINALIZAÇÃO\n"]
[null,"COORDENADORIA DE ENGENHARIA E ARQUITETURA"]
[null,"DIVISÃO DE SINALIZAÇÃO"]
[]
[]
[null,null,"EXECUÇÃO DE SERVIÇOS DE SINALIZAÇÃO VIÁRIA:","lote 02"]
[null,null,"PRAZO DE OBRA:",{"$f":"'[2]FOLHA FECHAMENTO'!G32","v":270},"DIAS CORRIDOS"]
[null,null,"COMPOSIÇÃO DE BDI PARA SERVIÇOS DE SINALIZAÇÃO VIÁRIA DO LOTE"]
{"$rows_left_out":32}
{"sheet":"QUANTITATIVO","index":6,"n_rows":43,"n_cols":8,"rows_kept":43,"cut":false,"hidden":true,"merged":[[1,1,2,1],[1,2,1,7]]}
[]
[null,"PLACAS"]
[null,null,1,2,3,4,5,"TOTAL"]
[null,"R-1"]
[null,"R-2"]
[null,"R-3"]
[null,"R-4a"]
[null,"R-4b"]
[null,"R-6a"]
[null,"R-6b TÁXI INICIO"]
{"$rows_left_out":34}
{"sheet":"CURVA ABC","index":7,"n_rows":47,"n_cols":15,"rows_kept":47,"cut":false,"hidden":false,"merged":[[5,1,5,11],[6,1,6,11],[7,1,7,11],[3,14,8,19],[3,4,3,6]]}
[]
[]
[]
[null,null,null,null,"ANEXO X - LOTE 2",null,null,null,null,null,null,null,null,null,"CLIQUE EM \"% DO ITEM\" E ORGANIZE DO MAIOR PARA O MENOR"]
[]
[null,"CURVA ABC DE SERVIÇOS"]
[null,"DEPARTAMENTO ESTADUAL DE TRÂNSITO - DETRAN PR"]
[null,"COORDENADORIA DE ENGENHARIA E ARQUITETURA - DIVISÃO DE SINALIZAÇÃO"]
[null,"PROJETO DE SINALIZAÇÃO VIÁRIA URBANA",null,null,{"$f":"'FOLHA FECHAMENTO'!D12","v":"lote 02"},null,null,null,null,"ART/RRT Nº:",{"$f":"'FOLHA FECHAMENTO'!M18","v":"16594464"}]
[null,"TABELAS DE REFERÊNCIA: SICRO (OUT/2025), DER (AGO/2025) e SCO-RIO (DEZ/2025), SIURB (OUT/2025) S. DESONERAÇÃO",null,null,"RESPONSÁVEL TÉCNICO: ",null,{"$f":"'FOLHA FECHAMENTO'!H17","v":"Amanda Patricia de Oliveira Henning"},null,null,"REG. CREA/CAU: ",{"$f":"'FOLHA FECHAMENTO'!M17","v":"A284127-4"}]
{"$rows_left_out":38}
{"sheet":"DECLARAÇÃO","index":8,"n_rows":43,"n_cols":12,"rows_kept":43,"cut":false,"hidden":true,"merged":[[3,11,6,16],[5,1,5,8],[6,1,6,8],[8,3,8,7],[11,1,11,8],[39,2,39,4],[39,5,39,7],[15,3,15,6],[25,2,25,4],[26,2,26,4],[26,5,26,7],[17,2,23,7],[33,2,36,7],[31,2,31,7],[38,2,38,4]]}
[]
[]
[]
[null,null,null,null,null,null,null,null,null,null,null,"EDITAR APENAS OS ITENS EM VERMELHO"]
[]
[]
[]
[]
[null,null,"PRÓPRIO:","EXECUÇÃO DE SERVIÇOS DE SINALIZAÇÃO VIÁRIA"]
[null,null,"MUNICÍPIO:",{"$f":"'FOLHA FECHAMENTO'!D12:I12","v":"lote 02"}]
{"$rows_left_out":34}
{"sheet":"PLANILHA REFERENCIA DETRAN PR","index":9,"n_rows":42,"n_cols":9,"rows_kept":42,"cut":false,"hidden":true,"merged":[[0,0,0,8],[3,0,4,0],[3,1,4,1],[3,2,3,4],[3,5,4,5],[3,6,4,6],[3,7,4,7],[3,8,4,8]]}
["PLANILHA DE CUSTOS DETRAN/PR"]
[]
[]
["ITEM","DESCRIÇÃO","FONTE",null,null,"UNIDADE","MÃO DE OBRA","MATERIAL","CUSTO UNITÁRIO"]
[null,null,"ÓRGÃO","CÓDIGO","DATA BASE"]
[1,"SINALIZAÇÃO VERTICAL"]
["1.1",{"$f":"IF(C7=\"derpr\",VLOOKUP(D7,der!A:J,3,FALSE),IF(C7=\"dnit\",VLOOKUP(D7,dnit!A:D,3,FALSE),IF(C7=\"detran-pr\",VLOOKUP(D7,Composições!D:K,2,FALSE),IF(C7=\"sco/rj\",VLOOKUP(D7,scorj!B:G,3,FALSE)))))","v":"Placa tipo R-1 - L = 0,25m. Com película refletiva tipo I A (prismática) - Área: 0,32 m²"},"DETRAN-PR","COMP.05",{"$f":"IF(C7=\"derpr\",der!$L$1,IF(C7=\"dnit\",dnit!$A$1,IF(C7=\"detran-pr\",scorj!$B$1,IF(C7=\"sco/rj\",scorj!$B$1))))","v":"2025-12-30"},{"$f":"IF(C7=\"derpr\",VLOOKUP(D7,der!A:J,3,FALSE),IF(C7=\"dnit\",VLOOKUP(D7,dnit!A:D,3,FALSE),IF(C7=\"detran-pr\",VLOOKUP(D7,Composições!D:K,3,FALSE),IF(C7=\"sco/rj\",VLOOKUP(D7,scorj!B:G,3,FALSE)))))","v":"m²"},{"$f":"IF(C7=\"derpr\",VLOOKUP(D7,der!A:J,9,FALSE),IF(C7=\"dnit\",VLOOKUP(D7,dnit!A:E,5,FALSE),IF(C7=\"detran-pr\",VLOOKUP(D7,Composições!D:K,8,FALSE),IF(C7=\"sco/rj\",VLOOKUP(D7,scorj!B:G,5,FALSE)))))","v":16.850000000000001},{"$f":"IF(C7=\"derpr\",VLOOKUP(D7,der!A:J,10,FALSE),IF(C7=\"dnit\",VLOOKUP(D7,dnit!A:E,4,FALSE),IF(C7=\"detran-pr\",VLOOKUP(D7,Composições!D:K,7,FALSE),IF(C7=\"sco/rj\",VLOOKUP(D7,scorj!B:G,4,FALSE)))))","v":155.25},{"$f":"IF(C7=\"derpr\",VLOOKUP(D7,der!A:J,7,FALSE),IF(C7=\"dnit\",VLOOKUP(D7,dnit!A:E,4,FALSE),IF(C7=\"detran-pr\",VLOOKUP(D7,Composições!D:K,6,FALSE),IF(C7=\"sco/rj\",VLOOKUP(D7,scorj!B:G,4,FALSE)))))","v":172.1}]
["1.2",{"$f":"IF(C8=\"derpr\",VLOOKUP(D8,der!A:J,3,FALSE),IF(C8=\"dnit\",VLOOKUP(D8,dnit!A:D,3,FALSE),IF(C8=\"detran-pr\",VLOOKUP(D8,Composições!D:K,2,FALSE),IF(C8=\"sco/rj\",VLOOKUP(D8,scorj!B:G,3,FALSE)))))","v":"Placa tipo R-2 - L = 0,75m. Com película refletiva tipo I A (prismática) - Área: 0,24m²"},"DETRAN-PR","COMP.06",{"$f":"IF(C8=\"derpr\",der!$L$1,IF(C8=\"dnit\",dnit!$A$1,IF(C8=\"detran-pr\",scorj!$B$1,IF(C8=\"sco/rj\",scorj!$B$1))))","v":"2025-12-30"},{"$f":"IF(C8=\"derpr\",VLOOKUP(D8,der!A:J,3,FALSE),IF(C8=\"dnit\",VLOOKUP(D8,dnit!A:D,3,FALSE),IF(C8=\"detran-pr\",VLOOKUP(D8,Composições!D:K,3,FALSE),IF(C8=\"sco/rj\",VLOOKUP(D8,scorj!B:G,3,FALSE)))))","v":"m²"},{"$f":"IF(C8=\"derpr\",VLOOKUP(D8,der!A:J,9,FALSE),IF(C8=\"dnit\",VLOOKUP(D8,dnit!A:E,5,FALSE),IF(C8=\"detran-pr\",VLOOKUP(D8,Composições!D:K,8,FALSE),IF(C8=\"sco/rj\",VLOOKUP(D8,scorj!B:G,5,FALSE)))))","v":12.64},{"$f":"IF(C8=\"derpr\",VLOOKUP(D8,der!A:J,10,FALSE),IF(C8=\"dnit\",VLOOKUP(D8,dnit!A:E,4,FALSE),IF(C8=\"detran-pr\",VLOOKUP(D8,Composições!D:K,7,FALSE),IF(C8=\"sco/rj\",VLOOKUP(D8,scorj!B:G,4,FALSE)))))","v":116.44},{"$f":"IF(C8=\"derpr\",VLOOKUP(D8,der!A:J,7,FALSE),IF(C8=\"dnit\",VLOOKUP(D8,dnit!A:E,4,FALSE),IF(C8=\"detran-pr\",VLOOKUP(D8,Composições!D:K,6,FALSE),IF(C8=\"sco/rj\",VLOOKUP(D8,scorj!B:G,4,FALSE)))))","v":129.08000000000001}]
["1.3",{"$f":"IF(C9=\"derpr\",VLOOKUP(D9,der!A:J,3,FALSE),IF(C9=\"dnit\",VLOOKUP(D9,dnit!A:D,3,FALSE),IF(C9=\"detran-pr\",VLOOKUP(D9,Composições!D:K,2,FALSE),IF(C9=\"sco/rj\",VLOOKUP(D9,scorj!B:G,3,FALSE)))))","v":"Placa tipo circular - D = 0,50m. Com película refletiva tipo I A (prismática) - Área: 0,21m²"},"DETRAN-PR","COMP.07",{"$f":"IF(C9=\"derpr\",der!$L$1,IF(C9=\"dnit\",dnit!$A$1,IF(C9=\"detran-pr\",scorj!$B$1,IF(C9=\"sco/rj\",scorj!$B$1))))","v":"2025-12-30"},{"$f":"IF(C9=\"derpr\",VLOOKUP(D9,der!A:J,3,FALSE),IF(C9=\"dnit\",VLOOKUP(D9,dnit!A:D,3,FALSE),IF(C9=\"detran-pr\",VLOOKUP(D9,Composições!D:K,3,FALSE),IF(C9=\"sco/rj\",VLOOKUP(D9,scorj!B:G,3,FALSE)))))","v":"m²"},{"$f":"IF(C9=\"derpr\",VLOOKUP(D9,der!A:J,9,FALSE),IF(C9=\"dnit\",VLOOKUP(D9,dnit!A:E,5,FALSE),IF(C9=\"detran-pr\",VLOOKUP(D9,Composições!D:K,8,FALSE),IF(C9=\"sco/rj\",VLOOKUP(D9,scorj!B:G,5,FALSE)))))","v":11.06},{"$f":"IF(C9=\"derpr\",VLOOKUP(D9,der!A:J,10,FALSE),IF(C9=\"dnit\",VLOOKUP(D9,dnit!A:E,4,FALSE),IF(C9=\"detran-pr\",VLOOKUP(D9,Composições!D:K,7,FALSE),IF(C9=\"sco/rj\",VLOOKUP(D9,scorj!B:G,4,FALSE)))))","v":101.88},{"$f":"IF(C9=\"derpr\",VLOOKUP(D9,der!A:J,7,FALSE),IF(C9=\"dnit\",VLOOKUP(D9,dnit!A:E,4,FALSE),IF(C9=\"detran-pr\",VLOOKUP(D9,Composições!D:K,6,FALSE),IF(C9=\"sco/rj\",VLOOKUP(D9,scorj!B:G,4,FALSE)))))","v":112.94}]
["1.4",{"$f":"IF(C10=\"derpr\",VLOOKUP(D10,der!A:J,3,FALSE),IF(C10=\"dnit\",VLOOKUP(D10,dnit!A:D,3,FALSE),IF(C10=\"detran-pr\",VLOOKUP(D10,Composições!D:K,2,FALSE),IF(C10=\"sco/rj\",VLOOKUP(D10,scorj!B:G,3,FALSE)))))","v":"Placa tipo de advertência - L = 0,50m. Com película refletiva tipo I A (prismática) - Área: 0,27 m²"},"DETRAN-PR","COMP.08",{"$f":"IF(C10=\"derpr\",der!$L$1,IF(C10=\"dnit\",dnit!$A$1,IF(C10=\"detran-pr\",scorj!$B$1,IF(C10=\"sco/rj\",scorj!$B$1))))","v":"2025-12-30"},{"$f":"IF(C10=\"derpr\",VLOOKUP(D10,der!A:J,3,FALSE),IF(C10=\"dnit\",VLOOKUP(D10,dnit!A:D,3,FALSE),IF(C10=\"detran-pr\",VLOOKUP(D10,Composições!D:K,3,FALSE),IF(C10=\"sco/rj\",VLOOKUP(D10,scorj!B:G,3,FALSE)))))","v":"m²"},{"$f":"IF(C10=\"derpr\",VLOOKUP(D10,der!A:J,9,FALSE),IF(C10=\"dnit\",VLOOKUP(D10,dnit!A:E,5,FALSE),IF(C10=\"detran-pr\",VLOOKUP(D10,Composições!D:K,8,FALSE),IF(C10=\"sco/rj\",VLOOKUP(D10,scorj!B:G,5,FALSE)))))","v":14.22},{"$f":"IF(C10=\"derpr\",VLOOKUP(D10,der!A:J,10,FALSE),IF(C10=\"dnit\",VLOOKUP(D10,dnit!A:E,4,FALSE),IF(C10=\"detran-pr\",VLOOKUP(D10,Composições!D:K,7,FALSE),IF(C10=\"sco/rj\",VLOOKUP(D10,scorj!B:G,4,FALSE)))))","v":130.99},{"$f":"IF(C10=\"derpr\",VLOOKUP(D10,der!A:J,7,FALSE),IF(C10=\"dnit\",VLOOKUP(D10,dnit!A:E,4,FALSE),IF(C10=\"detran-pr\",VLOOKUP(D10,Composições!D:K,6,FALSE),IF(C10=\"sco/rj\",VLOOKUP(D10,scorj!B:G,4,FALSE)))))","v":145.21}]
{"$rows_left_out":33}
{"sheet":"POR LOTE","index":10,"n_rows":107,"n_cols":43,"rows_kept":107,"cut":false,"hidden":true,"merged":[[67,3,68,6]]}
[null,null,null,null,null,"Com BDI","Sem BDI","BDI"]
[null,null,null,null,"Lote 01",{"$f":"SUMIF(E10:E61,\"Lote 01\",F10:F61)","v":4793631.9000000004},{"$f":"TRUNC(SUMIF(E10:E61,\"Lote 01\",B10:B61),2)","v":3925182.14},{"$f":"F2/G2-1","v":0.22125081818496195}]
[null,null,null,null,"Lote 02",{"$f":"SUMIF(E10:E61,\"Lote 02\",F10:F61)","v":4030999.25},{"$f":"SUMIF(E10:E61,\"Lote 02\",B10:B61)","v":3333482.5900000003},{"$f":"F3/G3-1","v":0.20924562860848761}]
[null,null,null,null,"Lote 03",{"$f":"SUMIF(E10:E61,\"Lote 03\",F10:F61)","v":4723765.4300000006},{"$f":"SUMIF(E10:E61,\"Lote 03\",B10:B61)","v":3887224.1899999995},{"$f":"F4/G4-1","v":0.21520272541831487}]
[null,null,null,null,"Lote 04",{"$f":"SUMIF(E10:E61,\"Lote 04\",F10:F61)","v":4057588.1599999997},{"$f":"SUMIF(E10:E61,\"Lote 04\",B10:B61)","v":3318853.1599999997},{"$f":"F5/G5-1","v":0.22258743137644577}]
[null,null,null,null,null,{"$f":"ROUND(SUM(F2:F5),2)","v":17605984.739999998}]
[null,null,null,null,null,null,null,null,null,null,null,null,null,null,null,null,null,null,null,null,null,null,null,null,null,null,null,null,null,null,null,null,"2.1","2.2","2.3","2.4","2.5","2.6","2.7","2.8","2.9","2.10","2.11"]
[null,null,null,null,null,null,null,172.1,129.08000000000001,112.94,145.21,268.92,537.82000000000005,810.79,675.66,409.61,465.61,520.75,12422.95,12814.63,18439.759999999998,435.21,53.26,26.2,299.64999999999998,1439.15,203.93,23343.1,13055.81,3523.7,3134.76,null,24.73,30.41,42.58,56.89,128.36000000000001,71.45,16.399999999999999,16.8,38.28,40.9,20.04]
["BDI","Valor sem Bdi","BDI","Cidade","Lote","Valor Previsto",1,"1.1","1.2","1.3","1.4","1.5","1.6","1.7","1.8","1.9","1.10","1.11","1.12","1.13","1.14","1.15","1.16","1.17","1.18","1.19","1.20","1.21","1.22","1.23","1.24",2,"2.1","2.2","2.3","2.4","2.5","2.6","2.7","2.8","2.9","2.10","2.11"]
[{"$f":"TRUNC((B10*C10),2)","v":62673.58},{"$f":"TRUNC(SUMPRODUCT($H$8:$AQ$8,H10:AQ10),2)","v":277801.96999999997},0.22560524532019688,"Anahy","Lote 01",{"$f":"ROUND(B10+(B10*C10),2)","v":340475.55},"-",17,1,77,26,null,47.32,null,null,111,42,null,8,1,1,null,10,2.63,null,null,null,null,null,null,null,null,null,1309.53,null,null,null,null,null,null,null,null,36.979999999999997]
{"$rows_left_out":98}
{"sheet":"der","index":11,"n_rows":777,"n_cols":14,"rows_kept":777,"cut":false,"hidden":true,"merged":[]}
["Código","Descrição do Serviço","Unidade","Custo Execução","Custo Material","Custo Sub-Serviço","Custo Unitário","Transporte","Material ","Mão de obra",null,45900]
[600000,"Escavação manual de vala 1a. cat.","m3",44.61,0,0,44.61,0,44.61,0]
[820000,"Placa sinalização c/ película refletiva","m2",190.97,346.85,0,537.82000000000005,0,190.97,346.85]
[822100,"Faixa de sinalização horizontal c/tinta resina acrílica base água","m2",10.19,12.05,0,22.24,0,10.19,12.05]
[515580,"Limpeza de pavimento com jato de água","m2",2.4900000000000002,0,0,2.4900000000000002,0,2.4900000000000002,0]
[822000,"Faixa de sinalização horizontal c/tinta resina acrílica base solvente","m2",10.19,17.73,0,27.92,0,10.19,17.73]
[515580,"Limpeza de pavimento com jato de água","m2",2.4900000000000002,0,0,2.4900000000000002,0,2.4900000000000002,0]
[822350,"Faixa de sinalização horizontal - termoplástico por aspersão - e=1,5mm","m2",18.32,21.77,0,40.090000000000003,0,18.32,21.77]
[515580,"Limpeza de pavimento com jato de água","m2",2.4900000000000002,0,0,2.4900000000000002,0,2.4900000000000002,0]
[822330,"Pintura de setas e zebrados - termoplástico por extrusão - e=3mm","m2",18.32,36.08,0,54.4,0,18.32,36.08]
{"$rows_left_out":768}
{"sheet":"dnit","index":12,"n_rows":8,"n_cols":4,"rows_kept":8,"cut":false,"hidden":true,"merged":[]}
[45931]
["5213351-ed","Suporte polimérico ecológico maciço colapsível D = 6,5 cm para placa de sinalização - fornecimento e implantação - 3,00 m","un",810.79]
[5213364,"Remoção de placa de sinalização","m²",26.2]
[5214009,"Pintura de faixa com plástico a frio bicomponente à base de resinas metacrílicas por extrusão (plano) - espessura de 1,5 mm","m²",125.87]
[5213413,"Pintura de faixa com plástico a frio tricomponente à base de resinas metacrílicas por aspersão - espessura de 0,6 mm","m²",68.959999999999994]
[5213351,"Suporte polimérico ecológico maciço colapsível D = 6,5 cm para placa de sinalização - fornecimento e implantação","un",675.66]
[5213364,"Remoção de placa de sinalização","m²",26.2]
[5213837,"Cilindro flexível delimitador de tráfego com duas faixas refletivas e chumbador - D = 20 cm e H = 80 cm","un",203.93]

{"sheet":"scorj","index":13,"n_rows":21,"n_cols":6,"rows_kept":21,"cut":false,"hidden":true,"merged":[[1,1,1,6],[2,1,2,6]]}
[null,46021]
[null,"Resultado da Pesquisa de Itens de Serviços"]
[null,"Pesquisa realizada em 03/02/2025\nMês/Ano de Referência: 12/2025                                                                                                                                              imprimir"]
[null,"Item de Serviço","Descrição","Und. de Medida","Custo R$","Ocorrências"]
[{"$f":"SUBSTITUTE(B5,\" (/)\",\"\")","v":"ST 64.05.0600"},"ST 64.05.0600 (/)","Coluna de aco, conica continua tipo I para ate 4 (quatro) bracos projetados capazes de sustentar, cada um, semaforo e placa de 3m2 (tres metros quadrados); coluna galvanizada a fogo; altura util total de 5,00m (cinco metros); diametro na base igual a 187mm (cento e oitenta e sete milimetros); conforme especificacao CET-RIO. Fornecimento.(desonerado)","un",8287.06,0]
["ST 64.15.0170 (A)","ST 64.15.0170 (A)","Assentamento de coluna de aco conica continua tipo I para ate 4 (quato) bracos projetados capazes de sustentar, cada um, semaforo e placa de 3m2 (tres metros quadrados) fixada por chumbadores engastados em fundacao de concreto, exclusive fundacao, exclusive fornecimento da coluna.(desonerado)","un",327.37,0]
["ST 64.05.0650","ST 64.05.0650 (/)","Braco projetado de aco para sustentacao de semaforo e placa ate 3m2 (tres metros quadrados), galvanizado a fogo; para fixacao em coluna cilindrica giratoria, projecao de 2,80m (dois metros e oitenta centimetros); diametro junto a flange de 123mm (cento e vinte e tres milimetros); conforme especificacao CET-RIO. Fornecimento.(desonerado)","un",3245,0]
["ST 64.15.0180","ST 64.15.0180 (/)","Montagem de braco projetado de aco em coluna de aco conica continua tipo I assentada, exclusive o fornecimento do braco.(desonerado)","un",83.93,0]
["ST 64.15.0340","ST 64.15.0340 (/)","Bloco de concreto armado medindo (0,60 x 0,60 x 1,00)m para uma coluna de aco conica continua para instalacao de ate 4 bracos projetados para sinalizacao.(desonerado)","un",479.59,0]
["ST 64.05.0600","ST 64.05.0600 (/)","Coluna de aco, conica continua tipo I para ate 4 (quatro) bracos projetados capazes de sustentar, cada um, semaforo e placa de 3m2 (tres metros quadrados); coluna galvanizada a fogo; altura util total de 5,00m (cinco metros); diametro na base igual a 187mm (cento e oitenta e sete milimetros); conforme especificacao CET-RIO. Fornecimento.(desonerado)","un",8287.06,0]
{"$rows_left_out":11}